Xcodebuild Clang Error Linker Command Failed With Exit Code 1

Cómo resolver el error

Cómo resolver el error "Linker command filed with exit code 1" de

Linker command failed - Xcode Build failed · Issue #1430 · react

Linker command failed - Xcode Build failed · Issue #1430 · react

How debug project in IOS? - Getting Started - NativeScript Community

How debug project in IOS? - Getting Started - NativeScript Community

Unreal Engine 4 22 Release Notes | Unreal Engine Documentation

Unreal Engine 4 22 Release Notes | Unreal Engine Documentation

Compilation speed: help test batch mode! - Compiler - Swift Forums

Compilation speed: help test batch mode! - Compiler - Swift Forums

Improving Your Build Time in Xcode 10 · Patrick Balestra

Improving Your Build Time in Xcode 10 · Patrick Balestra

Xcode】【iOS】ライブラリ導入時のApple Mach-O Linker Error  library

Xcode】【iOS】ライブラリ導入時のApple Mach-O Linker Error library

Invoking the Power of the Command Line | SpringerLink

Invoking the Power of the Command Line | SpringerLink

How to Install the Command Line Developer Tools Without Xcode « Mac

How to Install the Command Line Developer Tools Without Xcode « Mac

Migrating Perfect project to Swift 4 - By

Migrating Perfect project to Swift 4 - By

MOE Authentication or Native - Support - Multi-OS Engine

MOE Authentication or Native - Support - Multi-OS Engine

Unity - Manual: Troubleshooting on iOS devices

Unity - Manual: Troubleshooting on iOS devices

PVS-Studio Documentation (single file)

PVS-Studio Documentation (single file)

Ionic 2 Facebook Login: Step-by-step guide to get it working with

Ionic 2 Facebook Login: Step-by-step guide to get it working with

基本解决]使用iOS模拟器iPhone 6结果编译出错:file was built for i386

基本解决]使用iOS模拟器iPhone 6结果编译出错:file was built for i386

Duplicate Symbols For Architecture Arm64 Xcode 9 - Works Best Architects

Duplicate Symbols For Architecture Arm64 Xcode 9 - Works Best Architects

It Looks Like You're Still Trying to Use a Framework - Digital

It Looks Like You're Still Trying to Use a Framework - Digital

Setting up GitLab CI for iOS projects | GitLab

Setting up GitLab CI for iOS projects | GitLab

Article: Why am I getting a 'Library not found' error in Xcode

Article: Why am I getting a 'Library not found' error in Xcode

clang: error: linker command failed with exit code 1 (use -v to see

clang: error: linker command failed with exit code 1 (use -v to see

library not found for -liPhone-lib - Unity Forum

library not found for -liPhone-lib - Unity Forum

CocoaPods install | How to use CocoaPods | Podfile create | Pod

CocoaPods install | How to use CocoaPods | Podfile create | Pod

xcode] Archiveすると「clang: error: linker command failed with exit

xcode] Archiveすると「clang: error: linker command failed with exit

Ios Xcode 8 Apple Mach-O Linker (ld) Error Group in xcode - ionic-v3

Ios Xcode 8 Apple Mach-O Linker (ld) Error Group in xcode - ionic-v3

Sadeep's Tech Blog: How to install OpenCV on Mac OS X Lion to work

Sadeep's Tech Blog: How to install OpenCV on Mac OS X Lion to work

Overview of application publishing - Siberian CMS

Overview of application publishing - Siberian CMS

CLion answers frequently asked questions | CLion Blog

CLion answers frequently asked questions | CLion Blog

Undefined Symbols For Architecture Armv7 Xcode 6 2  5及之前的版本

Undefined Symbols For Architecture Armv7 Xcode 6 2 5及之前的版本

Native binding to Xamarin with libstdc++ as C++ Standard Library

Native binding to Xamarin with libstdc++ as C++ Standard Library

Xcode Build Error | Buildbox Official Forum

Xcode Build Error | Buildbox Official Forum

iOS Build Failure - ld: symbol(s) not found for architecture armv7

iOS Build Failure - ld: symbol(s) not found for architecture armv7

Let's Build Chuck Norris! - Part 8: Using C++ in an iOS application

Let's Build Chuck Norris! - Part 8: Using C++ in an iOS application

Migrating Perfect project to Swift 4 - By

Migrating Perfect project to Swift 4 - By

Export template for iOS can't be opened in latest Xcode 9 2 - Godot

Export template for iOS can't be opened in latest Xcode 9 2 - Godot

Creating and Distributing an iOS Binary Framework | Instabug Blog

Creating and Distributing an iOS Binary Framework | Instabug Blog

linker command failed with exit code 1 (use -v to see invocation) in

linker command failed with exit code 1 (use -v to see invocation) in

VIN scanner giving error in ios but working in android - ionic-v3

VIN scanner giving error in ios but working in android - ionic-v3

CocoaPods - Cocoa依赖管理器 - Ruby开发 - 评论 | CTOLib码库

CocoaPods - Cocoa依赖管理器 - Ruby开发 - 评论 | CTOLib码库

Static Libraries, Frameworks, and Bitcode - Heitor T  Sergent - Medium

Static Libraries, Frameworks, and Bitcode - Heitor T Sergent - Medium

Building and archiving detached app iOS Mac fails - Help: Expo SDK

Building and archiving detached app iOS Mac fails - Help: Expo SDK

Developers - iOS - Xcode: linker command failed with exit code 1

Developers - iOS - Xcode: linker command failed with exit code 1

基本解决]使用iOS模拟器iPhone 6结果编译出错:file was built for i386

基本解决]使用iOS模拟器iPhone 6结果编译出错:file was built for i386

Basic use of Xcode editor (1) - Programmer Sought

Basic use of Xcode editor (1) - Programmer Sought

iOS - Xcode: linker command failed with exit code 1, using firebase

iOS - Xcode: linker command failed with exit code 1, using firebase

CLion answers frequently asked questions | CLion Blog

CLion answers frequently asked questions | CLion Blog

Clang + OpenMP Setup in Xcode – Anton Menshov

Clang + OpenMP Setup in Xcode – Anton Menshov

Xcode version 4 6 2 (4H1003) compiler error - Stack Overflow

Xcode version 4 6 2 (4H1003) compiler error - Stack Overflow

Stay local, let your IDE do remote work for you! | CLion Blog

Stay local, let your IDE do remote work for you! | CLion Blog

Xcode Test Target - Linker errors, missing headers - MacOSX and iOS

Xcode Test Target - Linker errors, missing headers - MacOSX and iOS

Compile or cmake problems - Page 116 - Help and Support - TrinityCore

Compile or cmake problems - Page 116 - Help and Support - TrinityCore

Setting up a Testing Environment for iOS Apps - Mobile Security

Setting up a Testing Environment for iOS Apps - Mobile Security

Compile or cmake problems - Page 116 - Help and Support - TrinityCore

Compile or cmake problems - Page 116 - Help and Support - TrinityCore

Static Libraries, Frameworks, and Bitcode - Heitor T  Sergent - Medium

Static Libraries, Frameworks, and Bitcode - Heitor T Sergent - Medium

ld: framework not found ****** clang: error: linker command failed

ld: framework not found ****** clang: error: linker command failed

Indie Game Coding Confessions: HeyZap Integration

Indie Game Coding Confessions: HeyZap Integration

Mac OS X: Install GCC Compiler with Xcode - nixCraft

Mac OS X: Install GCC Compiler with Xcode - nixCraft

Xcode Creating Universal Frameworks as Dependents of a Universal

Xcode Creating Universal Frameworks as Dependents of a Universal

Creating a Static Library in iOS Tutorial | raywenderlich com

Creating a Static Library in iOS Tutorial | raywenderlich com

How to Deploy your App on an iPhone (Updated for 2018)

How to Deploy your App on an iPhone (Updated for 2018)

All about Missing dSYMs — Fabric for Apple documentation

All about Missing dSYMs — Fabric for Apple documentation

Basic use of Xcode editor (1) - Programmer Sought

Basic use of Xcode editor (1) - Programmer Sought

Creating and Distributing an iOS Binary Framework | Instabug Blog

Creating and Distributing an iOS Binary Framework | Instabug Blog

Error when building SampleScene from ARFoundation to iPhone 6s

Error when building SampleScene from ARFoundation to iPhone 6s

Getting error

Getting error "linker command failed with exit code 1 (use -v to see

Unity - Manual: Troubleshooting on iOS devices

Unity - Manual: Troubleshooting on iOS devices

Unable to change the PRODUCT_NAME in XCode - Printable Version

Unable to change the PRODUCT_NAME in XCode - Printable Version

How debug project in IOS? - Getting Started - NativeScript Community

How debug project in IOS? - Getting Started - NativeScript Community

PureBasic Forum • View topic - PB x86 compiler doesn't work anymore

PureBasic Forum • View topic - PB x86 compiler doesn't work anymore

Unity - Manual: Troubleshooting on iOS devices

Unity - Manual: Troubleshooting on iOS devices

clang: error: linker command failed with exit code 1 (use -v to see

clang: error: linker command failed with exit code 1 (use -v to see

Xcode出现( linker command failed with exit code 1)错误总结

Xcode出现( linker command failed with exit code 1)错误总结

It Looks Like You're Still Trying to Use a Framework - Digital

It Looks Like You're Still Trying to Use a Framework - Digital

Compile or cmake problems - Page 116 - Help and Support - TrinityCore

Compile or cmake problems - Page 116 - Help and Support - TrinityCore

All about Missing dSYMs — Fabric for Apple documentation

All about Missing dSYMs — Fabric for Apple documentation

IPA generation failing in Xcode 10 with iOS Plugin 8 3

IPA generation failing in Xcode 10 with iOS Plugin 8 3

Xcode - symbol(s) not found for architecture x86_64

Xcode - symbol(s) not found for architecture x86_64

iPhoneアプリ開発備忘録】 Xcode7 Build時のエラー 「 linker command

iPhoneアプリ開発備忘録】 Xcode7 Build時のエラー 「 linker command

Generating Java Bindings in 1 3 beta - How to do so? - Multi-OS Engine

Generating Java Bindings in 1 3 beta - How to do so? - Multi-OS Engine

iOS and Android setup on MacOS - Build Failed when trying to set up

iOS and Android setup on MacOS - Build Failed when trying to set up

HP Fortify Software Security Center | manualzz com

HP Fortify Software Security Center | manualzz com

Xcode 5 1 and Cordova iOS | Shazron's Cordova (aka PhoneGap) Blog

Xcode 5 1 and Cordova iOS | Shazron's Cordova (aka PhoneGap) Blog

clang: error: linker command failed with exit code 1 when archiving

clang: error: linker command failed with exit code 1 when archiving

iOS and Android setup on MacOS - Build Failed when trying to set up

iOS and Android setup on MacOS - Build Failed when trying to set up

Clang + OpenMP Setup in Xcode – Anton Menshov

Clang + OpenMP Setup in Xcode – Anton Menshov

Cocoapods remove duplicate symbols for architecture i386 error

Cocoapods remove duplicate symbols for architecture i386 error

Linker command failed with exit code 1 - ionic-v3 - Ionic Forum

Linker command failed with exit code 1 - ionic-v3 - Ionic Forum